{"text_format":"1","workbook":"xlsx","n_sheets":8,"sheets":["Menú","Informaciones iniciais","Informaciones mensuais","Alertas","Original","Comparativo","Aux","Ejemplo"],"not_rendered":{"charts":0,"images":3,"macros":1,"external_links":0,"defined_names":3,"comments":2,"pivot_tables":0},"unopened":[],"bounds":{"document_bytes":16777216,"sheet_cells":100000,"rows_first":2000,"rows_last":500,"rows_between":2000,"halvings":0,"cell_chars":16384,"cell_head_chars":4096},"cells_cut":0,"cells_raw":0,"read":"whole","date_system":"1900"}

{"sheet":"Menú","index":0,"n_rows":23,"n_cols":8,"rows_kept":23,"cut":false,"hidden":false,"merged":[[3,6,3,18],[6,7,13,17]]}
[]
[]
[]
[null,null,null,null,null,null,"Template para métricas mensais"]
[]
[null,null,null,null,null,null,null,"Preencher com o nome do Engarrafador:"]
[]
[]
[]
[]
{"$rows_left_out":14}
{"sheet":"Informaciones iniciais","index":1,"n_rows":18,"n_cols":16,"rows_kept":18,"cut":false,"hidden":false,"merged":[[6,7,6,13],[7,7,7,13],[8,7,8,13],[6,15,6,17],[8,15,8,17]]}
[]
[]
[]
[null,null,"Informaciones iniciales"]
[]
[]
[null,null,null,null,null,null,null,"Qual é a meta total de compra de EDFs para o ano?",null,null,null,null,null,null,null,{"$f":"IF('Informaciones mensuais'!AE7=\"\",\"\",IF(SUM('Informaciones mensuais'!C7:Z7)<'Informaciones iniciais'!O7,\"Plan incompleto, rever siguiente información:  Confirmación de pedidos con el proveedor\",\"\"))","v":""}]
[null,null,null,null,null,null,null,"Qual é a meta de instalação total (novos e usados) para o ano?"]
[null,null,null,null,null,null,null,"Qual é a % de instalação líquida definida em conjunto com a Coca-Cola com base nas instalações totais?",null,null,null,null,null,null,null,{"$f":"IF(O9>O8,\"Error: parque total es menor que  en el mercado\",\"\")","v":""}]
[]
{"$rows_left_out":9}
{"sheet":"Informaciones mensuais","index":2,"n_rows":23,"n_cols":39,"rows_kept":23,"cut":false,"hidden":false,"merged":[[3,23,3,25],[0,5,0,28],[0,2,0,3],[3,32,3,34],[3,2,3,4],[2,2,2,7],[2,9,2,14],[2,16,2,21],[2,23,2,28],[3,9,3,11],[3,16,3,18]]}
[null,null,"Preencher inconsist. \ne mês atual:",null,"Jan","Informações mensais"]
[]
[null,null,"Análises Q1/2022",null,null,null,null,null,null,"Análises Q2/2022",null,null,null,null,null,null,"Análises Q3/2022",null,null,null,null,null,null,"Análises Q4/2022"]
[null,null,"Template mensal",null,null,"Temp. trim.",null,null,null,"Template mensal",null,null,"Temp. trim.",null,null,null,"Template mensal",null,null,"Temp. trim.",null,null,null,"Template mensal",null,null,"Temp. trim."]
[null,"Processos 2022","Jan","Fev","Mar","Q1/2022",null,"Inconsistência?\nCaso sim, ajustar os dados do mês ou trimestre a esquerda",null,"Abr","Mai","Jun","Q2/2022",null,"Inconsistência?\nCaso sim, ajustar os dados do mês ou trimestre a esquerda",null,"Jul","Ago","Set","Q3/2022",null,"Inconsistência?\nCaso sim, ajustar os dados do mês ou trimestre a esquerda",null,"Out","Nov","Dez","Q4/2022",null,"Inconsistência?\nCaso sim, ajustar os dados do mês ou trimestre a esquerda",null,"Total",null,"vs último mês preenchido","vs YTD","Alerta","Razão","Justificativa (obrigatório somente para dados marcados como nok)",null,"Média"]
[]
[null,"Pedidos confirmados com o fornecedor de EDF",null,null,null,null,null,{"$f":"IF(F7=\"\",\"\",IF(F7=SUM(C7:E7),\"ok\",IF(F7>SUM(C7:E7),F7-SUM(C7:E7),F7-SUM(C7:E7))))","v":""},null,null,null,null,null,null,{"$f":"IF(M7=\"\",\"\",IF(M7=SUM(J7:L7),\"ok\",IF(M7>SUM(J7:L7),M7-SUM(J7:L7),M7-SUM(J7:L7))))","v":""},null,null,null,null,null,null,null,null,null,null,null,null,null,{"$f":"IF(AA7=\"\",\"\",IF(AA7=SUM(X7:Z7),\"ok\",IF(AA7>SUM(X7:Z7),AA7-SUM(X7:Z7),AA7-SUM(X7:Z7))))","v":""},null,{"$f":"IF(SUM(C7:E7,J7:L7,Q7:S7,X7:Z7)=0,\"\",SUM(C7:E7,J7:L7,Q7:S7,X7:Z7))","v":""}]
[null,"Plano de chegada dos EDFs comprados",null,null,null,null,null,{"$f":"IF(F8=\"\",\"\",IF(F8=SUM(C8:E8),\"ok\",IF(F8>SUM(C8:E8),F8-SUM(C8:E8),F8-SUM(C8:E8))))","v":""},null,null,null,null,null,null,{"$f":"IF(M8=\"\",\"\",IF(M8=SUM(J8:L8),\"ok\",IF(M8>SUM(J8:L8),M8-SUM(J8:L8),M8-SUM(J8:L8))))","v":""},null,null,null,null,null,null,null,null,null,null,null,null,null,{"$f":"IF(AA8=\"\",\"\",IF(AA8=SUM(X8:Z8),\"ok\",IF(AA8>SUM(X8:Z8),AA8-SUM(X8:Z8),AA8-SUM(X8:Z8))))","v":""},null,{"$f":"IF(SUM(C8:E8,J8:L8,Q8:S8,X8:Z8)=0,\"\",SUM(C8:E8,J8:L8,Q8:S8,X8:Z8))","v":""}]
["1.","Total de coolers\n(mercado + manutenção + descarte+ outros)",null,null,null,null,null,{"$f":"IF(F9=\"\",\"\",IF(F9=E9,\"ok\",IF(F9>E9,F9-E9,F9-E9)))","v":""},null,null,null,null,null,null,{"$f":"IF(M9=\"\",\"\",IF(M9=L9,\"ok\",IF(M9>L9,M9-L9,M9-L9)))","v":""},null,null,null,null,null,null,{"$f":"IF(T9=\"\",\"\",IF(T9=S9,\"ok\",IF(T9>S9,T9-S9,T9-S9)))","v":""},null,null,null,null,null,null,{"$f":"IF(AA9=\"\",\"\",IF(AA9=Z9,\"ok\",IF(AA9>Z9,AA9-Z9,AA9-Z9)))","v":""},null,null,null,{"$f":"IFERROR(ROUND(INDIRECT(Alertas!$D$1&CELL(\"lin\",AL9))/INDIRECT(Alertas!$D$2&CELL(\"lin\",AL9))-1,2),\"\")","v":""},{"$f":"IF(AG9<0,\"<\",\">\")&\" último mês\"","v":"> último mês"},{"$f":"IFERROR(VLOOKUP(ABS(AG9),Alertas!$A$9:$C$11,3,1),\"ok\")","v":"ok"},{"$f":"IF(AI9=\"ok\",\"\",AG9*100&\"% \"&AH9)","v":""}]
["2.","Total de coolers no mercado ",null,null,null,null,null,{"$f":"IF(F10=\"\",\"\",IF(F10=E10,\"ok\",IF(F10>E10,F10-E10,F10-E10)))","v":""},null,null,null,null,null,null,{"$f":"IF(M10=\"\",\"\",IF(M10=L10,\"ok\",IF(M10>L10,M10-L10,M10-L10)))","v":""},null,null,null,null,null,null,{"$f":"IF(T10=\"\",\"\",IF(T10=S10,\"ok\",IF(T10>S10,T10-S10,T10-S10)))","v":""},null,null,null,null,null,null,{"$f":"IF(AA10=\"\",\"\",IF(AA10=Z10,\"ok\",IF(AA10>Z10,AA10-Z10,AA10-Z10)))","v":""},null,null,null,{"$f":"IFERROR(ROUND(INDIRECT(Alertas!$D$1&CELL(\"lin\",AL10))/INDIRECT(Alertas!$D$2&CELL(\"lin\",AL10))-1,2),\"\")","v":""},{"$f":"IF(AG10<0,\"<\",\">\")&\" último mês\"","v":"> último mês"},{"$f":"IFERROR(VLOOKUP(ABS(AG10),Alertas!$D$9:$F$11,3,1),\"ok\")","v":"ok"},{"$f":"IF(AI10=\"ok\",\"\",AG10*100&\"% \"&AH10)","v":""}]
{"$rows_left_out":14}
{"sheet":"Alertas","index":3,"n_rows":20,"n_cols":19,"rows_kept":20,"cut":false,"hidden":true,"merged":[[12,0,12,2],[12,3,12,5],[12,6,12,8],[12,9,12,11],[0,0,0,1],[7,0,7,2],[7,3,7,5],[7,6,7,8],[7,9,7,11]]}
["Selecione o mês atual",null,"Dez",{"$f":"VLOOKUP(C1,$N$8:$O$19,2,0)","v":"z"}]
[null,null,{"$f":"VLOOKUP(C1,$N$8:$P$20,3,0)","v":"Nov"},{"$f":"VLOOKUP(C2,$P$9:$Q$20,2,0)","v":"y"}]
[]
[]
[]
[]
[null,null,null,null,null,null,null,null,null,null,null,null,null,null,null,null,null,"Plan de chegadas YTD","EDFs descartadas no último trimestre"]
["Total de coolers",null,null,"Total de coolers no mercado ",null,null,"Chegadas confirmadas dos EDFs ao bottler",null,null,"Instalação de EDFs total ",null,null,null,"Jan","c",null,null,{"$f":"'Informaciones mensuais'!C8","v":0}]
[0,0.05,"ok",0,0.05,"ok",0,0.1,"ok",0,0.1,"ok",null,"Fev","d","Jan","c",{"$f":"'Informaciones mensuais'!C8+'Informaciones mensuais'!D8","v":0}]
[{"$f":"B9+0.0000001","v":5.0000100000000006E-2},0.1,"Atención",{"$f":"E9+0.0000001","v":5.0000100000000006E-2},0.1,"Atención",{"$f":"H9+0.0000001","v":0.10000010000000001},0.2,"Atención",{"$f":"K9+0.0000001","v":0.10000010000000001},0.2,"Atención",null,"Mar","e","Fev","d",{"$f":"'Informaciones mensuais'!C8+'Informaciones mensuais'!D8+'Informaciones mensuais'!E8","v":0},"f16"]
{"$rows_left_out":11}
{"sheet":"Original","index":4,"n_rows":24,"n_cols":36,"rows_kept":24,"cut":false,"hidden":true,"merged":[[3,2,3,4],[3,9,3,11],[3,16,3,18],[3,23,3,25],[3,32,3,34],[0,2,0,3],[0,5,0,28],[2,2,2,7],[2,9,2,14],[2,16,2,21],[2,23,2,28]]}
[null,null,"Llenar inconsist. \ny mes actual:",null,{"$f":"'Informaciones mensuais'!E1","v":"Jan"},"Informaciones mensuales"]
[]
[null,null,"Análisis Q1/2021",null,null,null,null,null,null,"Análisis Q2/2021",null,null,null,null,null,null,"Análisis Q3/2021",null,null,null,null,null,null,"Análisis Q4/2021"]
[null,null,"Template mensual",null,null,"Temp. trim.",null,null,null,"Template mensual",null,null,"Temp. trim.",null,null,null,"Template mensual",null,null,"Temp. trim.",null,null,null,"Template mensual",null,null,"Temp. trim."]
[null,"Procesos 2021","Ene","Feb","Mar","Q1/2021",null,"Inconsistencia?\nCoso sí, ajustar los datos del mês o trimestre a la esquierda",null,"Abr","May","Jun","Q2/2021",null,"Inconsistencia?\nCoso sí, ajustar los datos del mês o trimestre a la esquierda",null,"Jul","Ago","Sep","Q3/2021",null,"Inconsistencia?\nCoso sí, ajustar los datos del mês o trimestre a la esquierda",null,"Oct","Nov","Dic","Q4/2021",null,"Inconsistencia?\nCoso sí, ajustar los datos del mês o trimestre a la esquierda",null,"Total",null,"vs último mês preenchido","vs promedio YTD","Alerta","Justificación (confirman que los datos señalados como rojo son correctos)"]
[]
[null,"Pedidos confirmados con el proveedor de cooler",12554,null,174,12748,null,{"$f":"IF(F7=\"\",\"\",IF(F7=SUM(C7:E7),\"ok\",IF(F7>SUM(C7:E7),F7-SUM(C7:E7),F7-SUM(C7:E7))))","v":20},null,null,null,null,0,null,{"$f":"IF(M7=\"\",\"\",IF(M7=SUM(J7:L7),\"ok\",IF(M7>SUM(J7:L7),M7-SUM(J7:L7),M7-SUM(J7:L7))))","v":"ok"},null,null,null,null,null,null,{"$f":"IF(T7=\"\",\"\",IF(T7=SUM(Q7:S7),\"ok\",IF(T7>SUM(Q7:S7),T7-SUM(Q7:S7),T7-SUM(Q7:S7))))","v":""},null,null,null,null,null,null,{"$f":"IF(AA7=\"\",\"\",IF(AA7=SUM(X7:Z7),\"ok\",IF(AA7>SUM(X7:Z7),AA7-SUM(X7:Z7),AA7-SUM(X7:Z7))))","v":""},null,{"$f":"IF(SUM(C7:E7,J7:L7,Q7:S7,X7:Z7)=0,\"\",SUM(C7:E7,J7:L7,Q7:S7,X7:Z7))","v":12728}]
[null,"Plan de llegada de los coolers comprados",198,1478,3182,4858,null,{"$f":"IF(F8=\"\",\"\",IF(F8=SUM(C8:E8),\"ok\",IF(F8>SUM(C8:E8),F8-SUM(C8:E8),F8-SUM(C8:E8))))","v":"ok"},null,2620,2999,1346,6965,null,{"$f":"IF(M8=\"\",\"\",IF(M8=SUM(J8:L8),\"ok\",IF(M8>SUM(J8:L8),M8-SUM(J8:L8),M8-SUM(J8:L8))))","v":"ok"},null,150,176,null,null,null,{"$f":"IF(T8=\"\",\"\",IF(T8=SUM(Q8:S8),\"ok\",IF(T8>SUM(Q8:S8),T8-SUM(Q8:S8),T8-SUM(Q8:S8))))","v":""},null,null,null,null,null,null,{"$f":"IF(AA8=\"\",\"\",IF(AA8=SUM(X8:Z8),\"ok\",IF(AA8>SUM(X8:Z8),AA8-SUM(X8:Z8),AA8-SUM(X8:Z8))))","v":""},null,{"$f":"IF(SUM(C8:E8,J8:L8,Q8:S8,X8:Z8)=0,\"\",SUM(C8:E8,J8:L8,Q8:S8,X8:Z8))","v":12149}]
["1.","Total de coolers\n(mercado + mantenimiento + descarte+ otros)\"",null,null,111488,111488,null,{"$f":"IF(F9=\"\",\"\",IF(F9=E9,\"ok\",IF(F9>E9,F9-E9,F9-E9)))","v":"ok"},null,112755,113713,109369,109369,null,{"$f":"IF(M9=\"\",\"\",IF(M9=L9,\"ok\",IF(M9>L9,M9-L9,M9-L9)))","v":"ok"},null,null,null,null,null,null,{"$f":"IF(T9=\"\",\"\",IF(T9=S9,\"ok\",IF(T9>S9,T9-S9,T9-S9)))","v":""},null,null,null,null,null,null,{"$f":"IF(AA9=\"\",\"\",IF(AA9=Z9,\"ok\",IF(AA9>Z9,AA9-Z9,AA9-Z9)))","v":""},null,null,null,{"$f":"IFERROR(K9/E9-1,\"\")","v":1.9957304822043609E-2},null,{"$f":"ABS(AG9)","v":1.9957304822043609E-2}]
["2.","Total de coolers en el mercado ",null,null,104510,104510,null,{"$f":"IF(F10=\"\",\"\",IF(F10=E10,\"ok\",IF(F10>E10,F10-E10,F10-E10)))","v":"ok"},null,105016,105390,101275,101275,null,{"$f":"IF(M10=\"\",\"\",IF(M10=L10,\"ok\",IF(M10>L10,M10-L10,M10-L10)))","v":"ok"},null,null,null,null,null,null,{"$f":"IF(T10=\"\",\"\",IF(T10=S10,\"ok\",IF(T10>S10,T10-S10,T10-S10)))","v":""},null,null,null,null,null,null,{"$f":"IF(AA10=\"\",\"\",IF(AA10=Z10,\"ok\",IF(AA10>Z10,AA10-Z10,AA10-Z10)))","v":""},null,null,null,{"$f":"IFERROR(K10/E10-1,\"\")","v":8.4202468663285845E-3},null,{"$f":"ABS(AG10)","v":8.4202468663285845E-3}]
{"$rows_left_out":15}
{"sheet":"Comparativo","index":5,"n_rows":24,"n_cols":36,"rows_kept":24,"cut":false,"hidden":true,"merged":[[3,2,3,4],[3,9,3,11],[3,16,3,18],[3,23,3,25],[3,32,3,34],[0,2,0,3],[0,5,0,28],[2,2,2,7],[2,9,2,14],[2,16,2,21],[2,23,2,28]]}
[null,null,"Llenar inconsist. \ny mes actual:",null,{"$f":"Original!período_selecionado","v":"Jan"},"Informaciones mensuales"]
[]
[null,null,"Análisis Q1/2021",null,null,null,null,null,null,"Análisis Q2/2021",null,null,null,null,null,null,"Análisis Q3/2021",null,null,null,null,null,null,"Análisis Q4/2021"]
[null,null,"Template mensual",null,null,"Temp. trim.",null,null,null,"Template mensual",null,null,"Temp. trim.",null,null,null,"Template mensual",null,null,"Temp. trim.",null,null,null,"Template mensual",null,null,"Temp. trim."]
[null,"Procesos 2021","Ene","Feb","Mar","Q1/2021",null,"Inconsistencia?\nCoso sí, ajustar los datos del mês o trimestre a la esquierda",null,"Abr","May","Jun","Q2/2021",null,"Inconsistencia?\nCoso sí, ajustar los datos del mês o trimestre a la esquierda",null,"Jul","Ago","Sep","Q3/2021",null,"Inconsistencia?\nCoso sí, ajustar los datos del mês o trimestre a la esquierda",null,"Oct","Nov","Dic","Q4/2021",null,"Inconsistencia?\nCoso sí, ajustar los datos del mês o trimestre a la esquierda",null,"Total",null,"vs último mês preenchido","vs promedio YTD","Alerta","Justificación (confirman que los datos señalados como rojo son correctos)"]
[]
[null,"Pedidos confirmados con el proveedor de cooler",{"$f":"'Informaciones mensuais'!C7=Original!C7","v":false},{"$f":"'Informaciones mensuais'!D7=Original!D7","v":true},{"$f":"'Informaciones mensuais'!E7=Original!E7","v":false},{"$f":"'Informaciones mensuais'!F7=Original!F7","v":false},null,null,null,{"$f":"'Informaciones mensuais'!J7=Original!J7","v":true},{"$f":"'Informaciones mensuais'!K7=Original!K7","v":true},{"$f":"'Informaciones mensuais'!L7=Original!L7","v":true},{"$f":"'Informaciones mensuais'!M7=Original!M7","v":true},null,null,null,{"$f":"'Informaciones mensuais'!Q7=Original!Q7","v":true},{"$f":"'Informaciones mensuais'!R7=Original!R7","v":true},{"$f":"'Informaciones mensuais'!S7=Original!S7","v":true},{"$f":"'Informaciones mensuais'!T7=Original!T7","v":true},null,null,null,{"$f":"'Informaciones mensuais'!X7=Original!X7","v":true},{"$f":"'Informaciones mensuais'!Y7=Original!Y7","v":true},{"$f":"'Informaciones mensuais'!Z7=Original!Z7","v":true},{"$f":"'Informaciones mensuais'!AA7=Original!AA7","v":true},null,null,null,{"$f":"IF(SUM(C7:E7,J7:L7,Q7:S7,X7:Z7)=0,\"\",SUM(C7:E7,J7:L7,Q7:S7,X7:Z7))","v":""}]
[null,"Plan de llegada de los coolers comprados",{"$f":"'Informaciones mensuais'!C8=Original!C8","v":false},{"$f":"'Informaciones mensuais'!D8=Original!D8","v":false},{"$f":"'Informaciones mensuais'!E8=Original!E8","v":false},{"$f":"'Informaciones mensuais'!F8=Original!F8","v":false},null,null,null,{"$f":"'Informaciones mensuais'!J8=Original!J8","v":false},{"$f":"'Informaciones mensuais'!K8=Original!K8","v":false},{"$f":"'Informaciones mensuais'!L8=Original!L8","v":false},{"$f":"'Informaciones mensuais'!M8=Original!M8","v":false},null,null,null,{"$f":"'Informaciones mensuais'!Q8=Original!Q8","v":false},{"$f":"'Informaciones mensuais'!R8=Original!R8","v":false},{"$f":"'Informaciones mensuais'!S8=Original!S8","v":true},{"$f":"'Informaciones mensuais'!T8=Original!T8","v":true},null,null,null,{"$f":"'Informaciones mensuais'!X8=Original!X8","v":true},{"$f":"'Informaciones mensuais'!Y8=Original!Y8","v":true},{"$f":"'Informaciones mensuais'!Z8=Original!Z8","v":true},{"$f":"'Informaciones mensuais'!AA8=Original!AA8","v":true},null,null,null,{"$f":"IF(SUM(C8:E8,J8:L8,Q8:S8,X8:Z8)=0,\"\",SUM(C8:E8,J8:L8,Q8:S8,X8:Z8))","v":""}]
["1.","Total de coolers\n(mercado + mantenimiento + descarte+ otros)\"",{"$f":"'Informaciones mensuais'!C9=Original!C9","v":true},{"$f":"'Informaciones mensuais'!D9=Original!D9","v":true},{"$f":"'Informaciones mensuais'!E9=Original!E9","v":false},{"$f":"'Informaciones mensuais'!F9=Original!F9","v":false},null,null,null,{"$f":"'Informaciones mensuais'!J9=Original!J9","v":false},{"$f":"'Informaciones mensuais'!K9=Original!K9","v":false},{"$f":"'Informaciones mensuais'!L9=Original!L9","v":false},{"$f":"'Informaciones mensuais'!M9=Original!M9","v":false},null,null,null,{"$f":"'Informaciones mensuais'!Q9=Original!Q9","v":true},{"$f":"'Informaciones mensuais'!R9=Original!R9","v":true},{"$f":"'Informaciones mensuais'!S9=Original!S9","v":true},{"$f":"'Informaciones mensuais'!T9=Original!T9","v":true},null,null,null,{"$f":"'Informaciones mensuais'!X9=Original!X9","v":true},{"$f":"'Informaciones mensuais'!Y9=Original!Y9","v":true},{"$f":"'Informaciones mensuais'!Z9=Original!Z9","v":true},{"$f":"'Informaciones mensuais'!AA9=Original!AA9","v":true},null,null,null,null,null,{"$f":"IFERROR(K9/E9-1,\"\")","v":""},null,{"$f":"ABS(AG9)","v":{"$error":"#VALUE!"}}]
["2.","Total de coolers en el mercado ",{"$f":"'Informaciones mensuais'!C10=Original!C10","v":true},{"$f":"'Informaciones mensuais'!D10=Original!D10","v":true},{"$f":"'Informaciones mensuais'!E10=Original!E10","v":false},{"$f":"'Informaciones mensuais'!F10=Original!F10","v":false},null,null,null,{"$f":"'Informaciones mensuais'!J10=Original!J10","v":false},{"$f":"'Informaciones mensuais'!K10=Original!K10","v":false},{"$f":"'Informaciones mensuais'!L10=Original!L10","v":false},{"$f":"'Informaciones mensuais'!M10=Original!M10","v":false},null,null,null,{"$f":"#REF!=Original!Q10","v":{"$error":"#REF!"}},{"$f":"'Informaciones mensuais'!Q10=Original!R10","v":true},{"$f":"'Informaciones mensuais'!S10=Original!S10","v":true},{"$f":"'Informaciones mensuais'!T10=Original!T10","v":true},null,null,null,{"$f":"'Informaciones mensuais'!X10=Original!X10","v":true},{"$f":"'Informaciones mensuais'!Y10=Original!Y10","v":true},{"$f":"'Informaciones mensuais'!Z10=Original!Z10","v":true},{"$f":"'Informaciones mensuais'!AA10=Original!AA10","v":true},null,null,null,null,null,{"$f":"IFERROR(K10/E10-1,\"\")","v":""},null,{"$f":"ABS(AG10)","v":{"$error":"#VALUE!"}}]
{"$rows_left_out":15}
{"sheet":"Aux","index":6,"n_rows":13,"n_cols":1,"rows_kept":13,"cut":false,"hidden":true,"merged":[]}
["-"]
["Jan"]
["Fev"]
["Mar"]
["Abr"]
["Mai"]
["Jun"]
["Jul"]
["Ago"]
["Set"]
{"$rows_left_out":4}
{"sheet":"Ejemplo","index":7,"n_rows":27,"n_cols":18,"rows_kept":27,"cut":false,"hidden":true,"merged":[]}
[]
[]
[]
[null,null,null,null,"Ejemplo"]
[]
[]
[null,null,null,null,"Procesos 2021","Ene","Feb","Mar","Abr","May","Jun","Jul","Ago","Sep","Oct","Nov","Dic","Total"]
[null,null,null,null,null,{"$f":"IF(R10=\"\",\"\",IF(R10<>R9,\"Rever plan de llegada de equipos\",\"\"))","v":""}]
[null,null,null,null,"Pedidos confirmados con el proveedor de EDF",10000,10000,null,null,null,null,null,null,null,null,null,null,{"$f":"IF(SUM(F9:Q9)=0,\"\",SUM(F9:Q9))","v":20000}]
[null,null,null,null,"Plan de llegada de los EDFs comprados",5000,null,5000,null,null,5000,null,null,null,5000,null,null,20000]
{"$rows_left_out":17}